Target
Alkaline phosphatase, tissue-nonspecific isozyme
Ligand
BDBM43812
Substrate
Meas. Tech.
SAR assay for compounds activating TNAP in the absence of phosphate acceptor performed in a luminescent assay
EC50
39500±n/a nM
Citation
 PubChem, PC SAR assay for compounds activating TNAP in the absence of phosphate acceptor performed in a luminescent assay PubChem Bioassay (2010)[AID] 
Target
Name:
Alkaline phosphatase, tissue-nonspecific isozyme
Synonyms:
ALPL tissue-nonspecific alkaline phosphatase precursor
Type:
PROTEIN
Mol. Mass.:
57306.17
Organism:
Homo sapiens (Human)
Description:
ChEMBL_1448917
Residue:
524
  
Inhibitor
Name:
BDBM43812
Synonyms:
2-(1H-benzimidazol-2-ylsulfanylmethyl)-5-methyl-imidazo[1,2-a]pyridine 2-[(1H-benzimidazol-2-ylthio)methyl]-5-methyl-imidazo[1,2-a]pyridine MLS-0256329.0001 | cid_741721
Type:
Small organic molecule
Emp. Form.:
C16H14N4S
Mol. Mass.:
294.374
SMILES:
Cc1cccc2nc(CSc3nc4ccccc4[nH]3)cn12
: