Target
Alkaline phosphatase, tissue-nonspecific isozyme
Ligand
BDBM43815
Substrate
Meas. Tech.
SAR assay for compounds activating TNAP in the absence of phosphate acceptor performed in a luminescent assay
EC50
18200±n/a nM
Citation
 PubChem, PC SAR assay for compounds activating TNAP in the absence of phosphate acceptor performed in a luminescent assay PubChem Bioassay (2010)[AID] 
Target
Name:
Alkaline phosphatase, tissue-nonspecific isozyme
Synonyms:
ALPL tissue-nonspecific alkaline phosphatase precursor
Type:
PROTEIN
Mol. Mass.:
57306.17
Organism:
Homo sapiens (Human)
Description:
ChEMBL_1448917
Residue:
524
  
Inhibitor
Name:
BDBM43815
Synonyms:
2-[ethyl-[(4-keto-1H-quinazolin-2-yl)methyl]amino]-N-(3-fluorophenyl)acetamide 2-[ethyl-[(4-oxo-1H-quinazolin-2-yl)methyl]amino]-N-(3-fluorophenyl)acetamide cid_4879819
Type:
Small organic molecule
Emp. Form.:
C19H19FN4O2
Mol. Mass.:
354.3782
SMILES:
CCN(CC(=O)Nc1cccc(F)c1)Cc1nc2ccccc2c(=O)[nH]1
: