Target
Solute carrier family 12 member 5
Ligand
BDBM43870
Substrate
Meas. Tech.
Identification of Novel Modulators of Cl- dependent Transport Process via HTS: Dose-Dependent Assay 2 with KCC2
EC50
11200±n/a nM
Citation
 PubChem, PC Identification of Novel Modulators of Cl- dependent Transport Process via HTS: Dose-Dependent Assay 2 with KCC2 PubChem Bioassay (2009)[AID] 
Target
Name:
Solute carrier family 12 member 5
Synonyms:
Electroneutral potassium-chloride cotransporter 2 KCC2 Neuronal K-Cl cotransporter SLC12A5 electroneutral potassium-chloride cotransporter KCC2 | hKCC2
Type:
PROTEIN
Mol. Mass.:
126185.18
Organism:
Homo sapiens (Human)
Description:
ChEMBL_828024
Residue:
1139
  
Inhibitor
Name:
BDBM43870
Synonyms:
7-[4-[4-(2,3-dimethylphenyl)-1-piperazinyl]-4-oxobutyl]-6-sulfanylidene-5H-[1,3]dioxolo[4,5-g]quinazolin-8-one 7-[4-[4-(2,3-dimethylphenyl)piperazin-1-yl]-4-oxobutyl]-6-sulfanylidene-5H-[1,3]dioxolo[4,5-g]quinazolin-8-one 7-{4-[4-(2,3-dimethylphenyl)piperazin-1-yl]-4-oxobutyl}-6-thioxo-6,7-dihydro[1,3]dioxolo[4,5-g]quinazolin-8(5H)-one SMR000030920 | cid_3241522
Type:
Small organic molecule
Emp. Form.:
C25H28N4O4S
Mol. Mass.:
480.579
SMILES:
Cc1cccc(N2CCN(CC2)C(=O)CCCn2c(=S)[nH]c3cc4OCOc4cc3c2=O)c1C
: