Target
Solute carrier family 12 member 5
Ligand
BDBM43885
Substrate
Meas. Tech.
Identification of Novel Modulators of Cl- dependent Transport Process via HTS: Dose-Dependent Assay 2 with KCC2
EC50
6660±n/a nM
Citation
 PubChem, PC Identification of Novel Modulators of Cl- dependent Transport Process via HTS: Dose-Dependent Assay 2 with KCC2 PubChem Bioassay (2009)[AID] 
Target
Name:
Solute carrier family 12 member 5
Synonyms:
Electroneutral potassium-chloride cotransporter 2 KCC2 Neuronal K-Cl cotransporter SLC12A5 electroneutral potassium-chloride cotransporter KCC2 | hKCC2
Type:
PROTEIN
Mol. Mass.:
126185.18
Organism:
Homo sapiens (Human)
Description:
ChEMBL_828024
Residue:
1139
  
Inhibitor
Name:
BDBM43885
Synonyms:
1-[(2,6-difluorobenzylidene)amino]-3-(3-pyridyl)thiourea 1-[(2,6-difluorophenyl)methylideneamino]-3-pyridin-3-ylthiourea MLS000516440 cid_2446755
Type:
Small organic molecule
Emp. Form.:
C13H10F2N4S
Mol. Mass.:
292.307
SMILES:
Fc1cccc(F)c1C=NNC(=S)Nc1cccnc1
: