Target
Solute carrier family 12 member 5
Ligand
BDBM43896
Substrate
Meas. Tech.
Identification of Novel Modulators of Cl- dependent Transport Process via HTS: Rubidium Flux
IC50
5100±n/a nM
Citation
 PubChem, PC Identification of Novel Modulators of Cl- dependent Transport Process via HTS: Rubidium Flux PubChem Bioassay (2009)[AID] 
Target
Name:
Solute carrier family 12 member 5
Synonyms:
Electroneutral potassium-chloride cotransporter 2 KCC2 Neuronal K-Cl cotransporter SLC12A5 electroneutral potassium-chloride cotransporter KCC2 | hKCC2
Type:
PROTEIN
Mol. Mass.:
126185.18
Organism:
Homo sapiens (Human)
Description:
ChEMBL_828024
Residue:
1139
  
Inhibitor
Name:
BDBM43896
Synonyms:
2-nitro-N-[4-[(phenylmethyl)sulfamoyl]phenyl]benzamide N-[4-(benzylsulfamoyl)phenyl]-2-nitrobenzamide cid_1303801
Type:
Small organic molecule
Emp. Form.:
C20H17N3O5S
Mol. Mass.:
411.431
SMILES:
[O-][N+](=O)c1ccccc1C(=O)Nc1ccc(cc1)S(=O)(=O)NCc1ccccc1
: