Target
Solute carrier family 12 member 5
Ligand
BDBM43904
Substrate
Meas. Tech.
Identification of Novel Modulators of Cl- dependent Transport Process via HTS: Rubidium Flux
IC50
2900±n/a nM
Citation
 PubChem, PC Identification of Novel Modulators of Cl- dependent Transport Process via HTS: Rubidium Flux PubChem Bioassay (2009)[AID] 
Target
Name:
Solute carrier family 12 member 5
Synonyms:
Electroneutral potassium-chloride cotransporter 2 KCC2 Neuronal K-Cl cotransporter SLC12A5 electroneutral potassium-chloride cotransporter KCC2 | hKCC2
Type:
PROTEIN
Mol. Mass.:
126185.18
Organism:
Homo sapiens (Human)
Description:
ChEMBL_828024
Residue:
1139
  
Inhibitor
Name:
BDBM43904
Synonyms:
2-(2,4-diketo-1,3-diazaspiro[4.4]nonan-3-yl)-N-[4-(4-fluorophenyl)thiazol-2-yl]acetamide 2-(2,4-dioxo-1,3-diazaspiro[4.4]nonan-3-yl)-N-[4-(4-fluorophenyl)-2-thiazolyl]acetamide VU0213500-2-D21 | cid_2095288
Type:
Small organic molecule
Emp. Form.:
C18H17FN4O3S
Mol. Mass.:
388.416
SMILES:
Fc1ccc(cc1)-c1csc(NC(=O)CN2C(=O)NC3(CCCC3)C2=O)n1
: