Target
E3 ubiquitin-protein ligase XIAP
Ligand
BDBM44316
Substrate
Meas. Tech.
SAR analysis of Antagonists of IAP-family anti-apoptotic proteins
IC50
4200±100 nM
Citation
 PubChem, PC SAR analysis of Antagonists of IAP-family anti-apoptotic proteins PubChem Bioassay (2009)[AID] 
Target
Name:
E3 ubiquitin-protein ligase XIAP
Synonyms:
API3 E3 ubiquitin-protein ligase XIAP Inhibitor of apoptosis protein 3 X-linked inhibitor of apoptosis XIAP | XIAP_HUMAN
Type:
Protein
Mol. Mass.:
56685.27
Organism:
Homo sapiens (Human)
Description:
P98170
Residue:
497
  
Inhibitor
Name:
BDBM44316
Synonyms:
MLS-0412151.0001 formic acid;(2S)-3-methyl-2-[[(2S)-2-(methylamino)-1-oxopropyl]amino]-N-[(2S)-3-methyl-1-oxo-1-(1,2,3,4-tetrahydronaphthalen-2-ylamino)butan-2-yl]butanamide formic acid;(2S)-3-methyl-2-[[(2S)-2-(methylamino)propanoyl]amino]-N-[(2S)-3-methyl-1-oxo-1-(1,2,3,4-tetrahydronaphthalen-2-ylamino)butan-2-yl]butanamide | methanoic acid;(2S)-3-methyl-2-[[(2S)-2-(methylamino)propanoyl]amino]-N-[(2S)-3-methyl-1-oxidanylidene-1-(1,2,3,4-tetrahydronaphthalen-2-ylamino)butan-2-yl]butanamide
Type:
Small organic molecule
Emp. Form.:
C24H38N4O3
Mol. Mass.:
430.5835
SMILES:
CN[C@@H](C)C(=O)N[C@@H](C(C)C)C(=O)N[C@@H](C(C)C)C(=O)NC1CCc2ccccc2C1
: