Target
E3 ubiquitin-protein ligase XIAP
Ligand
BDBM44337
Substrate
Meas. Tech.
SAR analysis of Antagonists of IAP-family anti-apoptotic proteins
IC50
9400±800 nM
Citation
 PubChem, PC SAR analysis of Antagonists of IAP-family anti-apoptotic proteins PubChem Bioassay (2009)[AID] 
Target
Name:
E3 ubiquitin-protein ligase XIAP
Synonyms:
API3 E3 ubiquitin-protein ligase XIAP Inhibitor of apoptosis protein 3 X-linked inhibitor of apoptosis XIAP | XIAP_HUMAN
Type:
Protein
Mol. Mass.:
56685.27
Organism:
Homo sapiens (Human)
Description:
P98170
Residue:
497
  
Inhibitor
Name:
BDBM44337
Synonyms:
MLS-0391033.0001 formic acid;(2S)-1-[(2S)-3-methyl-2-[[(2S)-2-(methylamino)-1-oxopropyl]amino]-1-oxobutyl]-N-(6-methyl-5-quinolinyl)-2-pyrrolidinecarboxamide formic acid;(2S)-1-[(2S)-3-methyl-2-[[(2S)-2-(methylamino)propanoyl]amino]butanoyl]-N-(6-methylquinolin-5-yl)pyrrolidine-2-carboxamide | methanoic acid;(2S)-1-[(2S)-3-methyl-2-[[(2S)-2-(methylamino)propanoyl]amino]butanoyl]-N-(6-methylquinolin-5-yl)pyrrolidine-2-carboxamide
Type:
Small organic molecule
Emp. Form.:
C24H33N5O3
Mol. Mass.:
439.5505
SMILES:
CN[C@@H](C)C(=O)N[C@@H](C(C)C)C(=O)N1CCC[C@H]1C(=O)Nc1c(C)ccc2ncccc12
: