Target
E3 ubiquitin-protein ligase XIAP
Ligand
BDBM44350
Substrate
Meas. Tech.
SAR analysis of Antagonists of IAP-family anti-apoptotic proteins
IC50
8300±300 nM
Citation
 PubChem, PC SAR analysis of Antagonists of IAP-family anti-apoptotic proteins PubChem Bioassay (2009)[AID] 
Target
Name:
E3 ubiquitin-protein ligase XIAP
Synonyms:
API3 E3 ubiquitin-protein ligase XIAP Inhibitor of apoptosis protein 3 X-linked inhibitor of apoptosis XIAP | XIAP_HUMAN
Type:
Protein
Mol. Mass.:
56685.27
Organism:
Homo sapiens (Human)
Description:
P98170
Residue:
497
  
Inhibitor
Name:
BDBM44350
Synonyms:
MLS-0425206.0001 cid_44229030 formic acid;N-[(5S)-6-keto-5-[[(2S)-3-methyl-2-[[(2S)-2-(methylamino)propanoyl]amino]butanoyl]amino]-6-(tetralin-1-ylamino)hexyl]carbamic acid benzyl ester | methanoic acid;(phenylmethyl) N-[(5S)-5-[[(2S)-3-methyl-2-[[(2S)-2-(methylamino)propanoyl]amino]butanoyl]amino]-6-oxidanylidene-6-(1,2,3,4-tetrahydronaphthalen-1-ylamino)hexyl]carbamate
Type:
Small organic molecule
Emp. Form.:
C33H47N5O5
Mol. Mass.:
593.7568
SMILES:
CN[C@@H](C)C(=O)N[C@@H](C(C)C)C(=O)N[C@@H](CCCCNC(=O)OCc1ccccc1)C(=O)NC1CCCc2ccccc12
: