Target
E3 ubiquitin-protein ligase XIAP
Ligand
BDBM44273
Substrate
Meas. Tech.
SAR analysis of Antagonists of XIAP-Bir3 domain of IAP-family anti-apoptotic proteins
IC50
380±0 nM
Citation
 PubChem, PC SAR analysis of Antagonists of XIAP-Bir3 domain of IAP-family anti-apoptotic proteins PubChem Bioassay (2009)[AID] 
Target
Name:
E3 ubiquitin-protein ligase XIAP
Synonyms:
API3 E3 ubiquitin-protein ligase XIAP Inhibitor of apoptosis protein 3 X-linked inhibitor of apoptosis XIAP | XIAP_HUMAN
Type:
Protein
Mol. Mass.:
56685.27
Organism:
Homo sapiens (Human)
Description:
P98170
Residue:
497
  
Inhibitor
Name:
BDBM44273
Synonyms:
MLS-0391006.0001 formic acid;(2S)-1-[(2S,3S)-3-methyl-2-[[(2S)-2-(methylamino)-1-oxopropyl]amino]-1-oxopentyl]-N-[(1R)-1,2,3,4-tetrahydronaphthalen-1-yl]-2-pyrrolidinecarboxamide formic acid;(2S)-1-[(2S,3S)-3-methyl-2-[[(2S)-2-(methylamino)propanoyl]amino]pentanoyl]-N-[(1R)-tetralin-1-yl]pyrrolidine-2-carboxamide | methanoic acid;(2S)-1-[(2S,3S)-3-methyl-2-[[(2S)-2-(methylamino)propanoyl]amino]pentanoyl]-N-[(1R)-1,2,3,4-tetrahydronaphthalen-1-yl]pyrrolidine-2-carboxamide
Type:
Small organic molecule
Emp. Form.:
C25H38N4O3
Mol. Mass.:
442.5942
SMILES:
CC[C@H](C)[C@H](NC(=O)[C@H](C)NC)C(=O)N1CCC[C@H]1C(=O)N[C@@H]1CCCc2ccccc12
: