Target
E3 ubiquitin-protein ligase XIAP
Ligand
BDBM44297
Substrate
Meas. Tech.
SAR analysis of Antagonists of XIAP-Bir3 domain of IAP-family anti-apoptotic proteins
IC50
850±120 nM
Citation
 PubChem, PC SAR analysis of Antagonists of XIAP-Bir3 domain of IAP-family anti-apoptotic proteins PubChem Bioassay (2009)[AID] 
Target
Name:
E3 ubiquitin-protein ligase XIAP
Synonyms:
API3 E3 ubiquitin-protein ligase XIAP Inhibitor of apoptosis protein 3 X-linked inhibitor of apoptosis XIAP | XIAP_HUMAN
Type:
Protein
Mol. Mass.:
56685.27
Organism:
Homo sapiens (Human)
Description:
P98170
Residue:
497
  
Inhibitor
Name:
BDBM44297
Synonyms:
(2S)-1-[(2S)-5-amino-2-[[(2S)-2-(methylamino)-1-oxopropyl]amino]-1,5-dioxopentyl]-N-(1,2,3,4-tetrahydronaphthalen-1-yl)-2-pyrrolidinecarboxamide;formic acid (2S)-1-[(2S)-5-amino-5-keto-2-[[(2S)-2-(methylamino)propanoyl]amino]pentanoyl]-N-tetralin-1-yl-pyrrolidine-2-carboxamide;formic acid MLS-0391060.0001 | cid_44182165
Type:
Small organic molecule
Emp. Form.:
C24H35N5O4
Mol. Mass.:
457.5658
SMILES:
CN[C@@H](C)C(=O)N[C@@H](CCC(N)=O)C(=O)N1CCC[C@H]1C(=O)NC1CCCc2ccccc12
: