Target
E3 ubiquitin-protein ligase XIAP
Ligand
BDBM44301
Substrate
Meas. Tech.
SAR analysis of Antagonists of XIAP-Bir3 domain of IAP-family anti-apoptotic proteins
IC50
54200±4500 nM
Citation
 PubChem, PC SAR analysis of Antagonists of XIAP-Bir3 domain of IAP-family anti-apoptotic proteins PubChem Bioassay (2009)[AID] 
Target
Name:
E3 ubiquitin-protein ligase XIAP
Synonyms:
API3 E3 ubiquitin-protein ligase XIAP Inhibitor of apoptosis protein 3 X-linked inhibitor of apoptosis XIAP | XIAP_HUMAN
Type:
Protein
Mol. Mass.:
56685.27
Organism:
Homo sapiens (Human)
Description:
P98170
Residue:
497
  
Inhibitor
Name:
BDBM44301
Synonyms:
(2S)-N-[(1S)-1-(anilinocarbamoyl)-4-guanidino-butyl]-3-methyl-2-[[(2S)-2-(methylamino)propanoyl]amino]butyramide;formic acid (2S)-N-[(2S)-5-(diaminomethylideneamino)-1-oxo-1-(phenylhydrazo)pentan-2-yl]-3-methyl-2-[[(2S)-2-(methylamino)-1-oxopropyl]amino]butanamide;formic acid MLS-0412063.0001 | cid_44182175
Type:
Small organic molecule
Emp. Form.:
C21H36N8O3
Mol. Mass.:
448.5623
SMILES:
[#6]-[#7]-[#6@@H](-[#6])-[#6](=O)-[#7]-[#6@@H](-[#6](-[#6])-[#6])-[#6](=O)-[#7]-[#6@@H](-[#6]-[#6]-[#6]\[#7]=[#6](\[#7])-[#7])-[#6](=O)-[#7]-[#7]-c1ccccc1
: