Target
E3 ubiquitin-protein ligase XIAP
Ligand
BDBM44330
Substrate
Meas. Tech.
SAR analysis of Antagonists of XIAP-Bir3 domain of IAP-family anti-apoptotic proteins
IC50
5400±300 nM
Citation
 PubChem, PC SAR analysis of Antagonists of XIAP-Bir3 domain of IAP-family anti-apoptotic proteins PubChem Bioassay (2009)[AID] 
Target
Name:
E3 ubiquitin-protein ligase XIAP
Synonyms:
API3 E3 ubiquitin-protein ligase XIAP Inhibitor of apoptosis protein 3 X-linked inhibitor of apoptosis XIAP | XIAP_HUMAN
Type:
Protein
Mol. Mass.:
56685.27
Organism:
Homo sapiens (Human)
Description:
P98170
Residue:
497
  
Inhibitor
Name:
BDBM44330
Synonyms:
MLS-0412179.0001 formic acid;(2S)-N-[(1S)-2-keto-1-methylol-2-(tetralin-1-ylamino)ethyl]-3-methyl-2-[[(2S)-2-(methylamino)propanoyl]amino]butyramide formic acid;(2S)-N-[(2S)-3-hydroxy-1-oxo-1-(1,2,3,4-tetrahydronaphthalen-1-ylamino)propan-2-yl]-3-methyl-2-[[(2S)-2-(methylamino)propanoyl]amino]butanamide | methanoic acid;(2S)-3-methyl-2-[[(2S)-2-(methylamino)propanoyl]amino]-N-[(2S)-3-oxidanyl-1-oxidanylidene-1-(1,2,3,4-tetrahydronaphthalen-1-ylamino)propan-2-yl]butanamide
Type:
Small organic molecule
Emp. Form.:
C22H34N4O4
Mol. Mass.:
418.5298
SMILES:
CN[C@@H](C)C(=O)N[C@@H](C(C)C)C(=O)N[C@@H](CO)C(=O)NC1CCCc2ccccc12
: