Target
Alkaline phosphatase, tissue-nonspecific isozyme
Ligand
BDBM44383
Substrate
Meas. Tech.
TNAP luminescent HTS assay
IC50
1990±70 nM
Citation
 PubChem, PC TNAP luminescent HTS assay PubChem Bioassay (2008)[AID] 
Target
Name:
Alkaline phosphatase, tissue-nonspecific isozyme
Synonyms:
ALPL tissue-nonspecific alkaline phosphatase precursor
Type:
PROTEIN
Mol. Mass.:
57306.17
Organism:
Homo sapiens (Human)
Description:
ChEMBL_1448917
Residue:
524
  
Inhibitor
Name:
BDBM44383
Synonyms:
MLS000034806 N-[5-(2-methoxyphenyl)-1H-1,2,4-triazol-3-yl]acetamide SMR000012783 | cid_646463
Type:
Small organic molecule
Emp. Form.:
C11H12N4O2
Mol. Mass.:
232.2386
SMILES:
COc1ccccc1-c1nnc(NC(C)=O)[nH]1
: