Target
Alkaline phosphatase, tissue-nonspecific isozyme
Ligand
BDBM44423
Substrate
Meas. Tech.
TNAP luminescent HTS assay
IC50
2670±210 nM
Citation
 PubChem, PC TNAP luminescent HTS assay PubChem Bioassay (2008)[AID] 
Target
Name:
Alkaline phosphatase, tissue-nonspecific isozyme
Synonyms:
ALPL tissue-nonspecific alkaline phosphatase precursor
Type:
PROTEIN
Mol. Mass.:
57306.17
Organism:
Homo sapiens (Human)
Description:
ChEMBL_1448917
Residue:
524
  
Inhibitor
Name:
BDBM44423
Synonyms:
3-(4-chlorophenyl)-1H-pyrazole-5-carboxylic acid MLS000113852 cid_738819
Type:
Small organic molecule
Emp. Form.:
C10H7ClN2O2
Mol. Mass.:
222.628
SMILES:
OC(=O)c1cc(n[nH]1)-c1ccc(Cl)cc1
: