Target
Ephrin type-A receptor 4
Ligand
BDBM44431
Substrate
Meas. Tech.
Colorimetric assay for HTS discovery of chemical inhibitors of EphA4 receptor antagonists
IC50
>100000±n/a nM
Citation
 PubChem, PC Colorimetric assay for HTS discovery of chemical inhibitors of EphA4 receptor antagonists PubChem Bioassay (2008)[AID] 
Target
Name:
Ephrin type-A receptor 4
Synonyms:
EPHA4_MOUSE Epha4 Sek1
Type:
Enzyme Catalytic Domain
Mol. Mass.:
109812.17
Organism:
Mus musculus
Description:
gi_34328113
Residue:
986
  
Inhibitor
Name:
BDBM44431
Synonyms:
MLS000038382 cid_6463323
Type:
Small organic molecule
Emp. Form.:
C20H22ClNO2
Mol. Mass.:
343.847
SMILES:
Cl.[H]C12CCN(CC1(OC(C)=O)c1ccc(C)cc1)c1ccccc21
: