Target
Ephrin type-A receptor 4
Ligand
BDBM44434
Substrate
Meas. Tech.
Colorimetric assay for HTS discovery of chemical inhibitors of EphA4 receptor antagonists
IC50
17500±n/a nM
Citation
 PubChem, PC Colorimetric assay for HTS discovery of chemical inhibitors of EphA4 receptor antagonists PubChem Bioassay (2008)[AID] 
Target
Name:
Ephrin type-A receptor 4
Synonyms:
EPHA4_MOUSE Epha4 Sek1
Type:
Enzyme Catalytic Domain
Mol. Mass.:
109812.17
Organism:
Mus musculus
Description:
gi_34328113
Residue:
986
  
Inhibitor
Name:
BDBM44434
Synonyms:
2-cyano-2-(3-piperidinoquinoxalin-2-yl)acetic acid 2-methylbutyl ester 2-methylbutyl 2-cyano-2-(3-piperidin-1-ylquinoxalin-2-yl)acetate MLS000041351 cid_662662
Type:
Small organic molecule
Emp. Form.:
C21H26N4O2
Mol. Mass.:
366.4567
SMILES:
CCC(C)COC(=O)C(C#N)c1nc2ccccc2nc1N1CCCCC1
: