Target
Ephrin type-A receptor 4
Ligand
BDBM34399
Substrate
Meas. Tech.
Colorimetric assay for HTS discovery of chemical inhibitors of EphA4 receptor antagonists
IC50
11300±n/a nM
Citation
 PubChem, PC Colorimetric assay for HTS discovery of chemical inhibitors of EphA4 receptor antagonists PubChem Bioassay (2008)[AID] 
Target
Name:
Ephrin type-A receptor 4
Synonyms:
EPHA4_MOUSE Epha4 Sek1
Type:
Enzyme Catalytic Domain
Mol. Mass.:
109812.17
Organism:
Mus musculus
Description:
gi_34328113
Residue:
986
  
Inhibitor
Name:
BDBM34399
Synonyms:
2,4-dimethyl-N-(4-methyl-1,3-benzothiazol-2-yl)-1,3-oxazole-5-carboxamide 2,4-dimethyl-N-(4-methyl-1,3-benzothiazol-2-yl)oxazole-5-carboxamide SMR000028532 | cid_3244965
Type:
Small organic molecule
Emp. Form.:
C14H13N3O2S
Mol. Mass.:
287.337
SMILES:
Cc1nc(C)c(o1)C(=O)Nc1nc2c(C)cccc2s1
: