Target
Ephrin type-A receptor 4
Ligand
BDBM44456
Substrate
Meas. Tech.
Colorimetric assay for HTS discovery of chemical inhibitors of EphA4 receptor antagonists
IC50
>100000±n/a nM
Citation
 PubChem, PC Colorimetric assay for HTS discovery of chemical inhibitors of EphA4 receptor antagonists PubChem Bioassay (2008)[AID] 
Target
Name:
Ephrin type-A receptor 4
Synonyms:
EPHA4_MOUSE Epha4 Sek1
Type:
Enzyme Catalytic Domain
Mol. Mass.:
109812.17
Organism:
Mus musculus
Description:
gi_34328113
Residue:
986
  
Inhibitor
Name:
BDBM44456
Synonyms:
3-[1,3-bis(oxidanylidene)isoindol-2-yl]-N-(1,5-dimethyl-3-oxidanylidene-2-phenyl-pyrazol-4-yl)propanamide N-(1,5-dimethyl-3-oxo-2-phenyl-4-pyrazolyl)-3-(1,3-dioxo-2-isoindolyl)propanamide N-(3-keto-1,5-dimethyl-2-phenyl-3-pyrazolin-4-yl)-3-phthalimido-propionamide cid_987854
Type:
Small organic molecule
Emp. Form.:
C22H20N4O4
Mol. Mass.:
404.4186
SMILES:
Cc1c(NC(=O)CCN2C(=O)c3ccccc3C2=O)c(=O)n(-c2ccccc2)n1C
: