Target
Ephrin type-A receptor 4
Ligand
BDBM41590
Substrate
Meas. Tech.
Colorimetric assay for HTS discovery of chemical inhibitors of EphA4 receptor antagonists
IC50
27500±n/a nM
Citation
 PubChem, PC Colorimetric assay for HTS discovery of chemical inhibitors of EphA4 receptor antagonists PubChem Bioassay (2008)[AID] 
Target
Name:
Ephrin type-A receptor 4
Synonyms:
EPHA4_MOUSE Epha4 Sek1
Type:
Enzyme Catalytic Domain
Mol. Mass.:
109812.17
Organism:
Mus musculus
Description:
gi_34328113
Residue:
986
  
Inhibitor
Name:
BDBM41590
Synonyms:
6-methoxy-2-(4-methoxyphenyl)-3-[3-(trifluoromethyl)phenyl]sulfanyl-1-benzothiophene 1-oxide 6-methoxy-2-(4-methoxyphenyl)-3-[[3-(trifluoromethyl)phenyl]thio]benzothiophene 1-oxide MLS000540587 cid_5863319
Type:
Small organic molecule
Emp. Form.:
C23H17F3O3S2
Mol. Mass.:
462.504
SMILES:
COc1ccc(cc1)-c1c(Sc2cccc(c2)C(F)(F)F)c2ccc(OC)cc2s1=O
: