Target
Ephrin type-A receptor 4
Ligand
BDBM33087
Substrate
Meas. Tech.
Colorimetric assay for HTS discovery of chemical inhibitors of EphA4 receptor antagonists
IC50
11100±n/a nM
Citation
 PubChem, PC Colorimetric assay for HTS discovery of chemical inhibitors of EphA4 receptor antagonists PubChem Bioassay (2008)[AID] 
Target
Name:
Ephrin type-A receptor 4
Synonyms:
EPHA4_MOUSE Epha4 Sek1
Type:
Enzyme Catalytic Domain
Mol. Mass.:
109812.17
Organism:
Mus musculus
Description:
gi_34328113
Residue:
986
  
Inhibitor
Name:
BDBM33087
Synonyms:
2,3-bis(2-furanyl)-N-(phenylmethyl)-6-quinoxalinecarboxamide MLS000534716 N-benzyl-2,3-bis(furan-2-yl)quinoxaline-6-carboxamide SMR000142133 | cid_1329592
Type:
Small organic molecule
Emp. Form.:
C24H17N3O3
Mol. Mass.:
395.4101
SMILES:
O=C(NCc1ccccc1)c1ccc2nc(-c3ccco3)c(nc2c1)-c1ccco1
: