Target
Ephrin type-A receptor 4
Ligand
BDBM44477
Substrate
Meas. Tech.
Colorimetric assay for HTS discovery of chemical inhibitors of EphA4 receptor antagonists
IC50
6730±n/a nM
Citation
 PubChem, PC Colorimetric assay for HTS discovery of chemical inhibitors of EphA4 receptor antagonists PubChem Bioassay (2008)[AID] 
Target
Name:
Ephrin type-A receptor 4
Synonyms:
EPHA4_MOUSE Epha4 Sek1
Type:
Enzyme Catalytic Domain
Mol. Mass.:
109812.17
Organism:
Mus musculus
Description:
gi_34328113
Residue:
986
  
Inhibitor
Name:
BDBM44477
Synonyms:
2-(5-Furan-2-yl-2,2-dimethyl-10-methylsulfanyl-1,4-dihydro-2H-3-oxa-7-thia-6,9,11-triaza-benzo[c]fluore n-8-ylsulfanyl)-ethanol SMR000148842 | cid_2005835
Type:
Small organic molecule
Emp. Form.:
C21H21N3O3S3
Mol. Mass.:
459.605
SMILES:
CSc1nc(SCCO)c2sc3nc(-c4ccco4)c4COC(C)(C)Cc4c3c2n1
: