Target
Ephrin type-A receptor 4
Ligand
BDBM44508
Substrate
Meas. Tech.
Colorimetric assay for HTS discovery of chemical inhibitors of EphA4 receptor antagonists
IC50
>100000±n/a nM
Citation
 PubChem, PC Colorimetric assay for HTS discovery of chemical inhibitors of EphA4 receptor antagonists PubChem Bioassay (2008)[AID] 
Target
Name:
Ephrin type-A receptor 4
Synonyms:
EPHA4_MOUSE Epha4 Sek1
Type:
Enzyme Catalytic Domain
Mol. Mass.:
109812.17
Organism:
Mus musculus
Description:
gi_34328113
Residue:
986
  
Inhibitor
Name:
BDBM44508
Synonyms:
2-[({2-[3-(methyloxy)phenyl]-1,3-dioxolan-2-yl}methyl)sulfanyl]-5-[3,4,5-tris(methyloxy)phenyl]-1,3,4-oxadiazole 2-[[2-(3-methoxyphenyl)-1,3-dioxolan-2-yl]methylthio]-5-(3,4,5-trimethoxyphenyl)-1,3,4-oxadiazole SMR000161022 | cid_6480450
Type:
Small organic molecule
Emp. Form.:
C22H24N2O7S
Mol. Mass.:
460.5
SMILES:
COc1cccc(c1)C1(CSc2nnc(o2)-c2cc(OC)c(OC)c(OC)c2)OCCO1
: