Target
Ephrin type-A receptor 4
Ligand
BDBM44520
Substrate
Meas. Tech.
Colorimetric assay for HTS discovery of chemical inhibitors of EphA4 receptor antagonists
IC50
1540±n/a nM
Citation
 PubChem, PC Colorimetric assay for HTS discovery of chemical inhibitors of EphA4 receptor antagonists PubChem Bioassay (2008)[AID] 
Target
Name:
Ephrin type-A receptor 4
Synonyms:
EPHA4_MOUSE Epha4 Sek1
Type:
Enzyme Catalytic Domain
Mol. Mass.:
109812.17
Organism:
Mus musculus
Description:
gi_34328113
Residue:
986
  
Inhibitor
Name:
BDBM44520
Synonyms:
(4Z)-4-[(7-methyl-2-morpholin-4-yl-quinolin-3-yl)methylidene]-2-phenyl-1,3-oxazol-5-one (4Z)-4-[(7-methyl-2-morpholino-3-quinolyl)methylene]-2-phenyl-2-oxazolin-5-one 4-{[7-methyl-2-(4-morpholinyl)-3-quinolinyl]methylene}-2-phenyl-1,3-oxazol-5(4H)-one SMR000196789 | cid_1325807
Type:
Small organic molecule
Emp. Form.:
C24H21N3O3
Mol. Mass.:
399.4418
SMILES:
Cc1ccc2cc(\C=C3/N=C(OC3=O)c3ccccc3)c(nc2c1)N1CCOCC1
: