Target
Ephrin type-A receptor 4
Ligand
BDBM44440
Substrate
Meas. Tech.
Counter Screen for Placental Alkaline Phosphatase-based Assays Positives
IC50
>50000±0 nM
Citation
 PubChem, PC Counter Screen for Placental Alkaline Phosphatase-based Assays Positives PubChem Bioassay (2008)[AID] 
Target
Name:
Ephrin type-A receptor 4
Synonyms:
EPHA4_MOUSE Epha4 Sek1
Type:
Enzyme Catalytic Domain
Mol. Mass.:
109812.17
Organism:
Mus musculus
Description:
gi_34328113
Residue:
986
  
Inhibitor
Name:
BDBM44440
Synonyms:
2-[[4-methyl-5-(2-methyl-3-furanyl)-1,2,4-triazol-3-yl]thio]-N-(2-phenylphenyl)acetamide 2-[[4-methyl-5-(2-methylfuran-3-yl)-1,2,4-triazol-3-yl]sulfanyl]-N-(2-phenylphenyl)acetamide MLS000058088 cid_2090174
Type:
Small organic molecule
Emp. Form.:
C22H20N4O2S
Mol. Mass.:
404.485
SMILES:
Cc1occc1-c1nnc(SCC(=O)Nc2ccccc2-c2ccccc2)n1C
: