Target
Ephrin type-A receptor 4
Ligand
BDBM34502
Substrate
Meas. Tech.
Counter Screen for Placental Alkaline Phosphatase-based Assays Positives
IC50
>50000±0 nM
Citation
 PubChem, PC Counter Screen for Placental Alkaline Phosphatase-based Assays Positives PubChem Bioassay (2008)[AID] 
Target
Name:
Ephrin type-A receptor 4
Synonyms:
EPHA4_MOUSE Epha4 Sek1
Type:
Enzyme Catalytic Domain
Mol. Mass.:
109812.17
Organism:
Mus musculus
Description:
gi_34328113
Residue:
986
  
Inhibitor
Name:
BDBM34502
Synonyms:
3-(2-methoxyphenyl)-8-(4-methylsulfanylphenyl)-6-oxidanylidene-2,4,7,8-tetrahydropyrido[2,1-b][1,3,5]thiadiazine-9-carbonitrile 3-(2-methoxyphenyl)-8-[4-(methylthio)phenyl]-6-oxo-2,4,7,8-tetrahydropyrido[2,1-b][1,3,5]thiadiazine-9-carbonitrile MLS000117254 cid_3160888
Type:
Small organic molecule
Emp. Form.:
C22H21N3O2S2
Mol. Mass.:
423.551
SMILES:
COc1ccccc1N1CSC2=C(C#N)C(CC(=O)N2C1)c1ccc(SC)cc1
: