Target
Ephrin type-A receptor 4
Ligand
BDBM44460
Substrate
Meas. Tech.
Counter Screen for Placental Alkaline Phosphatase-based Assays Positives
IC50
>50000±0 nM
Citation
 PubChem, PC Counter Screen for Placental Alkaline Phosphatase-based Assays Positives PubChem Bioassay (2008)[AID] 
Target
Name:
Ephrin type-A receptor 4
Synonyms:
EPHA4_MOUSE Epha4 Sek1
Type:
Enzyme Catalytic Domain
Mol. Mass.:
109812.17
Organism:
Mus musculus
Description:
gi_34328113
Residue:
986
  
Inhibitor
Name:
BDBM44460
Synonyms:
1-Amino-4-bromo-anthraquinone 1-amino-4-bromoanthracene-9,10-dione MLS000525406 cid_627326
Type:
Small organic molecule
Emp. Form.:
C14H8BrNO2
Mol. Mass.:
302.123
SMILES:
Nc1ccc(Br)c2C(=O)c3ccccc3C(=O)c12
: