Target
Ephrin type-A receptor 4
Ligand
BDBM44485
Substrate
Meas. Tech.
Counter Screen for Placental Alkaline Phosphatase-based Assays Positives
IC50
>50000±0 nM
Citation
 PubChem, PC Counter Screen for Placental Alkaline Phosphatase-based Assays Positives PubChem Bioassay (2008)[AID] 
Target
Name:
Ephrin type-A receptor 4
Synonyms:
EPHA4_MOUSE Epha4 Sek1
Type:
Enzyme Catalytic Domain
Mol. Mass.:
109812.17
Organism:
Mus musculus
Description:
gi_34328113
Residue:
986
  
Inhibitor
Name:
BDBM44485
Synonyms:
2-[(2-methyl-2,3-dihydroindol-1-yl)methyl]-7-(trifluoromethyl)-1H-quinazolin-4-one MLS000568080 cid_4779535
Type:
Small organic molecule
Emp. Form.:
C19H16F3N3O
Mol. Mass.:
359.345
SMILES:
CC1Cc2ccccc2N1Cc1nc2cc(ccc2c(=O)[nH]1)C(F)(F)F
: