Target
Ephrin type-A receptor 4
Ligand
BDBM44486
Substrate
Meas. Tech.
Counter Screen for Placental Alkaline Phosphatase-based Assays Positives
IC50
>50000±0 nM
Citation
 PubChem, PC Counter Screen for Placental Alkaline Phosphatase-based Assays Positives PubChem Bioassay (2008)[AID] 
Target
Name:
Ephrin type-A receptor 4
Synonyms:
EPHA4_MOUSE Epha4 Sek1
Type:
Enzyme Catalytic Domain
Mol. Mass.:
109812.17
Organism:
Mus musculus
Description:
gi_34328113
Residue:
986
  
Inhibitor
Name:
BDBM44486
Synonyms:
1-(7-ethyl-1H-indol-3-yl)-2-[[4-methyl-5-(2-methyl-3-furanyl)-1,2,4-triazol-3-yl]thio]ethanone 1-(7-ethyl-1H-indol-3-yl)-2-[[4-methyl-5-(2-methylfuran-3-yl)-1,2,4-triazol-3-yl]sulfanyl]ethanone SMR000152837 | cid_2484519
Type:
Small organic molecule
Emp. Form.:
C20H20N4O2S
Mol. Mass.:
380.463
SMILES:
CCc1cccc2c(c[nH]c12)C(=O)CSc1nnc(-c2ccoc2C)n1C
: