Target
Ephrin type-A receptor 4
Ligand
BDBM44490
Substrate
Meas. Tech.
Counter Screen for Placental Alkaline Phosphatase-based Assays Positives
IC50
>50000±0 nM
Citation
 PubChem, PC Counter Screen for Placental Alkaline Phosphatase-based Assays Positives PubChem Bioassay (2008)[AID] 
Target
Name:
Ephrin type-A receptor 4
Synonyms:
EPHA4_MOUSE Epha4 Sek1
Type:
Enzyme Catalytic Domain
Mol. Mass.:
109812.17
Organism:
Mus musculus
Description:
gi_34328113
Residue:
986
  
Inhibitor
Name:
BDBM44490
Synonyms:
(3Z)-1-ethyl-6-(6-oxidanylidene-4,5-dihydro-1H-pyridazin-3-yl)-3-[[2-(phenylmethylidene)hydrazinyl]methylidene]indol-2-one (3Z)-3-[(2-benzylidenehydrazinyl)methylidene]-1-ethyl-6-(6-oxo-4,5-dihydro-1H-pyridazin-3-yl)indol-2-one MLS000530557 benzaldehyde {[1-ethyl-2-oxo-6-(6-oxo-1,4,5,6-tetrahydro-3-pyridazinyl)-1,2-dihydro-3H-indol-3-ylidene]methyl}hydrazone | cid_9552009
Type:
Small organic molecule
Emp. Form.:
C22H21N5O2
Mol. Mass.:
387.4344
SMILES:
CCN1C(=O)C(C=NN=Cc2ccccc2)c2ccc(cc12)C1=NNC(=O)CC1
: