Target
Ephrin type-A receptor 4
Ligand
BDBM44496
Substrate
Meas. Tech.
Counter Screen for Placental Alkaline Phosphatase-based Assays Positives
IC50
>50000±0 nM
Citation
 PubChem, PC Counter Screen for Placental Alkaline Phosphatase-based Assays Positives PubChem Bioassay (2008)[AID] 
Target
Name:
Ephrin type-A receptor 4
Synonyms:
EPHA4_MOUSE Epha4 Sek1
Type:
Enzyme Catalytic Domain
Mol. Mass.:
109812.17
Organism:
Mus musculus
Description:
gi_34328113
Residue:
986
  
Inhibitor
Name:
BDBM44496
Synonyms:
4-(2,2,2-trifluoroethoxymethyl)-N-(3,4,5-trimethoxyphenyl)benzamide MLS000544202 SMR000159675 | cid_5163631
Type:
Small organic molecule
Emp. Form.:
C19H20F3NO5
Mol. Mass.:
399.361
SMILES:
COc1cc(NC(=O)c2ccc(COCC(F)(F)F)cc2)cc(OC)c1OC
: