Target
Protein Rev [8-24]
Ligand
BDBM44540
Substrate
Meas. Tech.
Dose response biochemical assay to identify inhibitors of the HIV Rev - RRE RNA interaction (disruption of protein-RNA interaction)
IC50
>79370±n/a nM
Citation
 PubChem, PC Dose response biochemical assay to identify inhibitors of the HIV Rev - RRE RNA interaction (disruption of protein-RNA interaction) PubChem Bioassay (2007)[AID] 
Target
Name:
Protein Rev [8-24]
Synonyms:
Chain B, Rna Aptamer Complexed With Hiv-1 Rev Peptide, Nmr, 7 Structures rev
Type:
Enzyme Catalytic Domain
Mol. Mass.:
2446.81
Organism:
Human immunodeficiency virus 1
Description:
gi_253722402
Residue:
17
TRQARRNRRRRWRERQR
  
Inhibitor
Name:
BDBM44540
Synonyms:
3-(4-cumylphenoxy)propyl-methyl-amine;oxalic acid N-methyl-3-[4-(1-methyl-1-phenylethyl)phenoxy]-1-propanamine oxalate N-methyl-3-[4-(2-phenylpropan-2-yl)phenoxy]propan-1-amine;oxalic acid cid_2949415 | ethanedioic acid;N-methyl-3-[4-(2-phenylpropan-2-yl)phenoxy]propan-1-amine
Type:
Small organic molecule
Emp. Form.:
C19H25NO
Mol. Mass.:
283.4079
SMILES:
CNCCCOc1ccc(cc1)C(C)(C)c1ccccc1
: