Target
Sphingosine 1-phosphate receptor 2
Ligand
BDBM41639
Substrate
Meas. Tech.
Counter screen for S1P2 Agonists: Dose Response High Throughput Cell-Based Screen to Identify Activators of CRE-BLA
EC50
>50000±n/a nM
Citation
 PubChem, PC Counter screen for S1P2 Agonists: Dose Response High Throughput Cell-Based Screen to Identify Activators of CRE-BLA PubChem Bioassay (2007)[AID] 
Target
Name:
Sphingosine 1-phosphate receptor 2
Synonyms:
EDG5 S1PR2 Sphingosine 1-phosphate receptor Sphingosine-1-phosphate receptor 2 | ndothelial differentiation G-protein coupled receptor 5
Type:
G Protein-Coupled Receptor (GPCR)
Mol. Mass.:
38883.16
Organism:
Homo sapiens (Human)
Description:
Membranes isolated from S1P2-transfected CHO cells were used in ligand binding assay.
Residue:
353
  
Inhibitor
Name:
BDBM41639
Synonyms:
MLS000075167 N-cyclopentyl-2-[[5-(5-methyl-1,2-oxazol-3-yl)-1,3,4-oxadiazol-2-yl]sulfanyl]acetamide N-cyclopentyl-2-[[5-(5-methyl-3-isoxazolyl)-1,3,4-oxadiazol-2-yl]thio]acetamide SMR000008274 | cid_647358
Type:
Small organic molecule
Emp. Form.:
C13H16N4O3S
Mol. Mass.:
308.356
SMILES:
Cc1cc(no1)-c1nnc(SCC(=O)NC2CCCC2)o1
: