Target
Sphingosine 1-phosphate receptor 2
Ligand
BDBM41671
Substrate
Meas. Tech.
Counter screen for S1P2 Agonists: Dose Response High Throughput Cell-Based Screen to Identify Activators of CRE-BLA
EC50
>50000±n/a nM
Citation
 PubChem, PC Counter screen for S1P2 Agonists: Dose Response High Throughput Cell-Based Screen to Identify Activators of CRE-BLA PubChem Bioassay (2007)[AID] 
Target
Name:
Sphingosine 1-phosphate receptor 2
Synonyms:
EDG5 S1PR2 Sphingosine 1-phosphate receptor Sphingosine-1-phosphate receptor 2 | ndothelial differentiation G-protein coupled receptor 5
Type:
G Protein-Coupled Receptor (GPCR)
Mol. Mass.:
38883.16
Organism:
Homo sapiens (Human)
Description:
Membranes isolated from S1P2-transfected CHO cells were used in ligand binding assay.
Residue:
353
  
Inhibitor
Name:
BDBM41671
Synonyms:
1-(5-chloranyl-2-methoxy-phenyl)-3-propyl-6,7-dihydro-5H-indazol-4-one 1-(5-chloro-2-methoxyphenyl)-3-propyl-6,7-dihydro-5H-indazol-4-one SMR000127579 | cid_713301
Type:
Small organic molecule
Emp. Form.:
C17H19ClN2O2
Mol. Mass.:
318.798
SMILES:
CCCc1nn(c2CCCC(=O)c12)-c1cc(Cl)ccc1OC
: