Target
Multidrug resistance-associated protein 1
Ligand
BDBM44756
Substrate
Meas. Tech.
Identification of Molecular Probes that Activate MRP-1 - Dose Response
EC50
4705±n/a nM
Citation
 PubChem, PC Identification of Molecular Probes that Activate MRP-1 - Dose Response PubChem Bioassay (2007)[AID] 
Target
Name:
Multidrug resistance-associated protein 1
Synonyms:
7.6.2.2 ABCC1 ATP-binding cassette, sub-family C, member 1 isoform 1 LTC4 transporter MRP MRP1_HUMAN
Type:
Mol. Mass.:
171597.72
Organism:
Homo sapiens (Human)
Description:
P33527
Residue:
1531
  
Inhibitor
Name:
BDBM44756
Synonyms:
MLS000117086 [2-[(4-fluorobenzyl)thio]-2-imidazolin-1-yl]-(2-furyl)methanone [2-[(4-fluorophenyl)methylthio]-4,5-dihydroimidazol-1-yl]-(2-furanyl)methanone | cid_3334605
Type:
Small organic molecule
Emp. Form.:
C15H13FN2O2S
Mol. Mass.:
304.339
SMILES:
Fc1ccc(CSC2=NCCN2C(=O)c2ccco2)cc1
: