Target
Multidrug resistance-associated protein 1
Ligand
BDBM44762
Substrate
Meas. Tech.
Identification of Molecular Probes that Activate MRP-1 - Dose Response
EC50
3675±n/a nM
Citation
 PubChem, PC Identification of Molecular Probes that Activate MRP-1 - Dose Response PubChem Bioassay (2007)[AID] 
Target
Name:
Multidrug resistance-associated protein 1
Synonyms:
7.6.2.2 ABCC1 ATP-binding cassette, sub-family C, member 1 isoform 1 LTC4 transporter MRP MRP1_HUMAN
Type:
Mol. Mass.:
171597.72
Organism:
Homo sapiens (Human)
Description:
P33527
Residue:
1531
  
Inhibitor
Name:
BDBM44762
Synonyms:
5-[[4-(3-chlorophenyl)-1-piperazinyl]-thiophen-2-ylmethyl]-6-thiazolo[3,2-b][1,2,4]triazolol 5-[[4-(3-chlorophenyl)piperazin-1-yl]-thiophen-2-ylmethyl]-[1,3]thiazolo[3,2-b][1,2,4]triazol-6-ol MLS000103653 cid_3454559
Type:
Small organic molecule
Emp. Form.:
C19H18ClN5OS2
Mol. Mass.:
431.962
SMILES:
Oc1c(sc2ncnn12)C(N1CCN(CC1)c1cccc(Cl)c1)c1cccs1
: