Target
Coagulation factor XII
Ligand
BDBM33843
Substrate
Meas. Tech.
Factor XIIa 1536 HTS Dose Response Confirmation
IC50
80.85±6.495976 nM
Citation
 PubChem, PC Factor XIIa 1536 HTS Dose Response Confirmation PubChem Bioassay (2008)[AID] 
Target
Name:
Coagulation factor XII
Synonyms:
Beta-factor XIIa part 1 Carboxylesterase 2 (intestine, liver) Coagulation factor XII (FXII) Coagulation factor XIIa light chain FA12_HUMAN Factor XIIa (fXIIa) Hageman factor
Type:
Enzyme
Mol. Mass.:
67810.07
Organism:
Homo sapiens (Human)
Description:
P00748
Residue:
615
  
Inhibitor
Name:
BDBM33843
Synonyms:
(5-amino-3-pyridin-3-yl-1,2,4-triazol-1-yl)-(4-fluorophenyl)methanone 1-(4-fluorobenzoyl)-3-(3-pyridinyl)-1H-1,2,4-triazol-5-amine SMR000294586 [5-amino-3-(3-pyridyl)-1,2,4-triazol-1-yl]-(4-fluorophenyl)methanone | cid_972160
Type:
Small organic molecule
Emp. Form.:
C14H10FN5O
Mol. Mass.:
283.2605
SMILES:
Nc1nc(nn1C(=O)c1ccc(F)cc1)-c1cccnc1
: