Target
Coagulation factor XII
Ligand
BDBM33902
Substrate
Meas. Tech.
Factor XIIa 1536 HTS Dose Response Confirmation
IC50
10.423333±11.612383 nM
Citation
 PubChem, PC Factor XIIa 1536 HTS Dose Response Confirmation PubChem Bioassay (2008)[AID] 
Target
Name:
Coagulation factor XII
Synonyms:
Beta-factor XIIa part 1 Carboxylesterase 2 (intestine, liver) Coagulation factor XII (FXII) Coagulation factor XIIa light chain FA12_HUMAN Factor XIIa (fXIIa) Hageman factor
Type:
Enzyme
Mol. Mass.:
67810.07
Organism:
Homo sapiens (Human)
Description:
P00748
Residue:
615
  
Inhibitor
Name:
BDBM33902
Synonyms:
3-[(4-tert-butylbenzoyl)amino]-1H-1,2,4-triazole-5-carboxylic acid methyl ester MLS001003740 cid_2314952 methyl 3-[(4-tert-butylphenyl)carbonylamino]-1H-1,2,4-triazole-5-carboxylate
Type:
Small organic molecule
Emp. Form.:
C15H18N4O3
Mol. Mass.:
302.3284
SMILES:
COC(=O)c1nnc(NC(=O)c2ccc(cc2)C(C)(C)C)[nH]1
: