Target
Sphingosine 1-phosphate receptor 2
Ligand
BDBM39698
Substrate
Meas. Tech.
Counterscreen for S1P2 Antagonists: Dose Response Cell-Based Screen to Identify Antagonists of CRE-BLA
IC50
41.97±n/a nM
Citation
 PubChem, PC Counterscreen for S1P2 Antagonists: Dose Response Cell-Based Screen to Identify Antagonists of CRE-BLA PubChem Bioassay (2008)[AID] 
Target
Name:
Sphingosine 1-phosphate receptor 2
Synonyms:
EDG5 S1PR2 Sphingosine 1-phosphate receptor Sphingosine-1-phosphate receptor 2 | ndothelial differentiation G-protein coupled receptor 5
Type:
G Protein-Coupled Receptor (GPCR)
Mol. Mass.:
38883.16
Organism:
Homo sapiens (Human)
Description:
Membranes isolated from S1P2-transfected CHO cells were used in ligand binding assay.
Residue:
353
  
Inhibitor
Name:
BDBM39698
Synonyms:
MLS000519095 N-octylquinazolin-4-amine cid_9550933 | octyl(quinazolin-4-yl)amine
Type:
Small organic molecule
Emp. Form.:
C16H23N3
Mol. Mass.:
257.3739
SMILES:
CCCCCCCCNc1ncnc2ccccc12
: