Target
Sphingosine 1-phosphate receptor 2
Ligand
BDBM41609
Substrate
Meas. Tech.
Counterscreen for S1P2 Antagonists: Dose Response Cell-Based Screen to Identify Antagonists of CRE-BLA
IC50
3079±n/a nM
Citation
 PubChem, PC Counterscreen for S1P2 Antagonists: Dose Response Cell-Based Screen to Identify Antagonists of CRE-BLA PubChem Bioassay (2008)[AID] 
Target
Name:
Sphingosine 1-phosphate receptor 2
Synonyms:
EDG5 S1PR2 Sphingosine 1-phosphate receptor Sphingosine-1-phosphate receptor 2 | ndothelial differentiation G-protein coupled receptor 5
Type:
G Protein-Coupled Receptor (GPCR)
Mol. Mass.:
38883.16
Organism:
Homo sapiens (Human)
Description:
Membranes isolated from S1P2-transfected CHO cells were used in ligand binding assay.
Residue:
353
  
Inhibitor
Name:
BDBM41609
Synonyms:
(4,5-dichloro-6-oxopyridazin-1-yl)methyl 4-methylbenzoate 4-methylbenzoic acid (4,5-dichloro-6-oxo-1-pyridazinyl)methyl ester SMR000180164 [4,5-dichloro-6-oxo-1(6H)-pyridazinyl]methyl 4-methylbenzenecarboxylate | cid_1474465
Type:
Small organic molecule
Emp. Form.:
C13H10Cl2N2O3
Mol. Mass.:
313.136
SMILES:
Cc1ccc(cc1)C(=O)OCn1ncc(Cl)c(Cl)c1=O
: