Target
Sphingosine 1-phosphate receptor 2
Ligand
BDBM41613
Substrate
Meas. Tech.
Counterscreen for S1P2 Antagonists: Dose Response Cell-Based Screen to Identify Antagonists of CRE-BLA
IC50
1817±n/a nM
Citation
 PubChem, PC Counterscreen for S1P2 Antagonists: Dose Response Cell-Based Screen to Identify Antagonists of CRE-BLA PubChem Bioassay (2008)[AID] 
Target
Name:
Sphingosine 1-phosphate receptor 2
Synonyms:
EDG5 S1PR2 Sphingosine 1-phosphate receptor Sphingosine-1-phosphate receptor 2 | ndothelial differentiation G-protein coupled receptor 5
Type:
G Protein-Coupled Receptor (GPCR)
Mol. Mass.:
38883.16
Organism:
Homo sapiens (Human)
Description:
Membranes isolated from S1P2-transfected CHO cells were used in ligand binding assay.
Residue:
353
  
Inhibitor
Name:
BDBM41613
Synonyms:
5-bromanyl-N-[[3-(4-methylphenyl)-1-phenyl-pyrazol-4-yl]methylideneamino]furan-2-carboxamide 5-bromo-N-[[1-phenyl-3-(p-tolyl)pyrazol-4-yl]methyleneamino]-2-furamide 5-bromo-N-[[3-(4-methylphenyl)-1-phenylpyrazol-4-yl]methylideneamino]furan-2-carboxamide SMR000187045 | cid_1365339
Type:
Small organic molecule
Emp. Form.:
C22H17BrN4O2
Mol. Mass.:
449.3
SMILES:
Cc1ccc(cc1)-c1nn(cc1C=NNC(=O)c1ccc(Br)o1)-c1ccccc1
: