Target
Serine/threonine-protein kinase PLK1
Ligand
BDBM41754
Substrate
Meas. Tech.
Concentration Response Redox Cycling H2O2 Generation assay, 1 mM DTT, to characterize small molecule inhibitors identified in the Polo box domain (PBD) of Plk1 Primary HTS.
EC50
>50000±n/a nM
Citation
 PubChem, PC Concentration Response Redox Cycling H2O2 Generation assay, 1 mM DTT, to characterize small molecule inhibitors identified in the Polo box domain (PBD) of Plk1 Primary HTS. PubChem Bioassay (2007)[AID] 
Target
Name:
Serine/threonine-protein kinase PLK1
Synonyms:
PLK PLK1 Polo-like kinase 1 (PlK1) STPK13 Serine/threonine-protein kinase 13 | polo-like kinase
Type:
Serine/threonine-protein kinase
Mol. Mass.:
68277.16
Organism:
Homo sapiens (Human)
Description:
P53350
Residue:
603
  
Inhibitor
Name:
BDBM41754
Synonyms:
3-(4-Methoxy-benzyl)-3H-benzothiazol-2-one 3-p-anisyl-1,3-benzothiazol-2-one SMR000015012 | cid_649921
Type:
Small organic molecule
Emp. Form.:
C15H13NO2S
Mol. Mass.:
271.334
SMILES:
COc1ccc(Cn2c3ccccc3sc2=O)cc1
: