Target
Serine/threonine-protein kinase PLK1
Ligand
BDBM41798
Substrate
Meas. Tech.
Concentration Response Redox Cycling H2O2 Generation assay, 1 mM DTT, to characterize small molecule inhibitors identified in the Polo box domain (PBD) of Plk1 Primary HTS.
EC50
>50000±n/a nM
Citation
 PubChem, PC Concentration Response Redox Cycling H2O2 Generation assay, 1 mM DTT, to characterize small molecule inhibitors identified in the Polo box domain (PBD) of Plk1 Primary HTS. PubChem Bioassay (2007)[AID] 
Target
Name:
Serine/threonine-protein kinase PLK1
Synonyms:
PLK PLK1 Polo-like kinase 1 (PlK1) STPK13 Serine/threonine-protein kinase 13 | polo-like kinase
Type:
Serine/threonine-protein kinase
Mol. Mass.:
68277.16
Organism:
Homo sapiens (Human)
Description:
P53350
Residue:
603
  
Inhibitor
Name:
BDBM41798
Synonyms:
3-(3,5-dimethyl-1-pyrazolyl)-6-phenyl-7H-[1,2,4]triazolo[3,4-b][1,3,4]thiadiazine 3-(3,5-dimethylpyrazol-1-yl)-6-phenyl-7H-[1,2,4]triazolo[3,4-b][1,3,4]thiadiazine SMR000072098 | cid_887538
Type:
Small organic molecule
Emp. Form.:
C15H14N6S
Mol. Mass.:
310.377
SMILES:
Cc1cc(C)n(n1)-c1nnc2SCC(=Nn12)c1ccccc1
: