Target
Serine/threonine-protein kinase PLK1
Ligand
BDBM41810
Substrate
Meas. Tech.
Concentration Response Redox Cycling H2O2 Generation assay, 1 mM DTT, to characterize small molecule inhibitors identified in the Polo box domain (PBD) of Plk1 Primary HTS.
EC50
>50000±n/a nM
Citation
 PubChem, PC Concentration Response Redox Cycling H2O2 Generation assay, 1 mM DTT, to characterize small molecule inhibitors identified in the Polo box domain (PBD) of Plk1 Primary HTS. PubChem Bioassay (2007)[AID] 
Target
Name:
Serine/threonine-protein kinase PLK1
Synonyms:
PLK PLK1 Polo-like kinase 1 (PlK1) STPK13 Serine/threonine-protein kinase 13 | polo-like kinase
Type:
Serine/threonine-protein kinase
Mol. Mass.:
68277.16
Organism:
Homo sapiens (Human)
Description:
P53350
Residue:
603
  
Inhibitor
Name:
BDBM41810
Synonyms:
2-(2,3-dihydro-1,4-benzodioxin-6-ylcarbamoyl)cyclohexane-1-carboxylic acid 2-[(2,3-dihydro-1,4-benzodioxin-6-ylamino)-oxomethyl]-1-cyclohexanecarboxylic acid SMR000103924 | cid_2862450
Type:
Small organic molecule
Emp. Form.:
C16H19NO5
Mol. Mass.:
305.3258
SMILES:
OC(=O)C1CCCCC1C(=O)Nc1ccc2OCCOc2c1
: