Target
Serine/threonine-protein kinase PLK1
Ligand
BDBM40314
Substrate
Meas. Tech.
Concentration Response Redox Cycling H2O2 Generation assay, 1 mM DTT, to characterize small molecule inhibitors identified in the Polo box domain (PBD) of Plk1 Primary HTS.
EC50
>50000±n/a nM
Citation
 PubChem, PC Concentration Response Redox Cycling H2O2 Generation assay, 1 mM DTT, to characterize small molecule inhibitors identified in the Polo box domain (PBD) of Plk1 Primary HTS. PubChem Bioassay (2007)[AID] 
Target
Name:
Serine/threonine-protein kinase PLK1
Synonyms:
PLK PLK1 Polo-like kinase 1 (PlK1) STPK13 Serine/threonine-protein kinase 13 | polo-like kinase
Type:
Serine/threonine-protein kinase
Mol. Mass.:
68277.16
Organism:
Homo sapiens (Human)
Description:
P53350
Residue:
603
  
Inhibitor
Name:
BDBM40314
Synonyms:
3-(4-Chloro-phenyl)-1,6-dimethyl-1H-pyrimido[5,4-e][1,2,4]triazine-5,7-dione 3-(4-chlorophenyl)-1,6-dimethyl-pyrimido[5,4-e][1,2,4]triazine-5,7-quinone MLS000523518 US9073941, 603 | cid_460749
Type:
Small organic molecule
Emp. Form.:
C13H10ClN5O2
Mol. Mass.:
303.704
SMILES:
Cn1nc(nc2c1nc(=O)n(C)c2=O)-c1ccc(Cl)cc1
: