Target
Serine/threonine-protein kinase PLK1
Ligand
BDBM41816
Substrate
Meas. Tech.
Concentration Response Redox Cycling H2O2 Generation assay, 1 mM DTT, to characterize small molecule inhibitors identified in the Polo box domain (PBD) of Plk1 Primary HTS.
EC50
>50000±n/a nM
Citation
 PubChem, PC Concentration Response Redox Cycling H2O2 Generation assay, 1 mM DTT, to characterize small molecule inhibitors identified in the Polo box domain (PBD) of Plk1 Primary HTS. PubChem Bioassay (2007)[AID] 
Target
Name:
Serine/threonine-protein kinase PLK1
Synonyms:
PLK PLK1 Polo-like kinase 1 (PlK1) STPK13 Serine/threonine-protein kinase 13 | polo-like kinase
Type:
Serine/threonine-protein kinase
Mol. Mass.:
68277.16
Organism:
Homo sapiens (Human)
Description:
P53350
Residue:
603
  
Inhibitor
Name:
BDBM41816
Synonyms:
(NE)-N-[3-(2,4-dimethylanilino)-4-keto-1-naphthylidene]thiophene-2-sulfonamide (NE)-N-[3-(2,4-dimethylanilino)-4-oxonaphthalen-1-ylidene]thiophene-2-sulfonamide MLS000549894 SMR000113727 | cid_9549688
Type:
Small organic molecule
Emp. Form.:
C22H18N2O3S2
Mol. Mass.:
422.52
SMILES:
Cc1ccc(NC2=CC(=NS(=O)(=O)c3cccs3)c3ccccc3C2=O)c(C)c1
: