Target
Serine/threonine-protein kinase PLK1
Ligand
BDBM41829
Substrate
Meas. Tech.
Concentration Response Redox Cycling H2O2 Generation assay, 1 mM DTT, to characterize small molecule inhibitors identified in the Polo box domain (PBD) of Plk1 Primary HTS.
EC50
>50000±n/a nM
Citation
 PubChem, PC Concentration Response Redox Cycling H2O2 Generation assay, 1 mM DTT, to characterize small molecule inhibitors identified in the Polo box domain (PBD) of Plk1 Primary HTS. PubChem Bioassay (2007)[AID] 
Target
Name:
Serine/threonine-protein kinase PLK1
Synonyms:
PLK PLK1 Polo-like kinase 1 (PlK1) STPK13 Serine/threonine-protein kinase 13 | polo-like kinase
Type:
Serine/threonine-protein kinase
Mol. Mass.:
68277.16
Organism:
Homo sapiens (Human)
Description:
P53350
Residue:
603
  
Inhibitor
Name:
BDBM41829
Synonyms:
2,2-Dimethyl-propionic acid 3-(1-methyl-1H-benzoimidazol-2-yl)-2-oxo-2H-chromen-7-yl ester 2,2-dimethylpropionic acid [2-keto-3-(1-methylbenzimidazol-2-yl)chromen-7-yl] ester SMR000148091 [3-(1-methylbenzimidazol-2-yl)-2-oxochromen-7-yl] 2,2-dimethylpropanoate | cid_1522831
Type:
Small organic molecule
Emp. Form.:
C22H20N2O4
Mol. Mass.:
376.4052
SMILES:
Cn1c(nc2ccccc12)-c1cc2ccc(OC(=O)C(C)(C)C)cc2oc1=O
: