Target
Diphosphomevalonate decarboxylase
Ligand
BDBM45766
Substrate
Meas. Tech.
Screening for Inhibitors of the Mevalonate Pathway in Streptococcus Pneumoniae - DPM-DC - Secondary Assay
IC50
2250±16500 nM
Citation
 PubChem, PC Screening for Inhibitors of the Mevalonate Pathway in Streptococcus Pneumoniae - DPM-DC - Secondary Assay PubChem Bioassay (2008)[AID] 
Target
Name:
Diphosphomevalonate decarboxylase
Synonyms:
Type:
Enzyme Catalytic Domain
Mol. Mass.:
35571.44
Organism:
Streptococcus pneumoniae D39
Description:
A0A0H2ZN59
Residue:
317
  
Inhibitor
Name:
BDBM45766
Synonyms:
2-(3-pyrrolidin-1-ylcarbonylphenyl)-1,2-benzothiazol-3-one 2-[3-[oxo(1-pyrrolidinyl)methyl]phenyl]-1,2-benzothiazol-3-one cid_16749990
Type:
Small organic molecule
Emp. Form.:
C18H16N2O2S
Mol. Mass.:
324.397
SMILES:
O=C(N1CCCC1)c1cccc(c1)-n1sc2ccccc2c1=O
: