Target
Alkaline phosphatase, tissue-nonspecific isozyme
Ligand
BDBM44418
Substrate
Meas. Tech.
SAR analysis of an In Vitro TNAP Dose Response Luminescent Assay
IC50
449±n/a nM
Citation
 PubChem, PC SAR analysis of an In Vitro TNAP Dose Response Luminescent Assay PubChem Bioassay (2010)[AID] 
Target
Name:
Alkaline phosphatase, tissue-nonspecific isozyme
Synonyms:
ALPL tissue-nonspecific alkaline phosphatase precursor
Type:
PROTEIN
Mol. Mass.:
57306.17
Organism:
Homo sapiens (Human)
Description:
ChEMBL_1448917
Residue:
524
  
Inhibitor
Name:
BDBM44418
Synonyms:
MLS000114796 N-(3-propylsulfanyl-1H-1,2,4-triazol-5-yl)ethanamide SMR000092101 | cid_5307194
Type:
Small organic molecule
Emp. Form.:
C7H12N4OS
Mol. Mass.:
200.261
SMILES:
CCCSc1nnc(NC(C)=O)[nH]1
: