Target
Serine/threonine-protein kinase PLK1
Ligand
BDBM46096
Substrate
Meas. Tech.
Concentration Response fluorescence polarization-based assay to test PMLSC Chemistry Core synthesized analogs of confirmed hits from the Polo box domain (PBD) of Plk1 Primary HTS.
IC50
>50000±n/a nM
Citation
 PubChem, PC Concentration Response fluorescence polarization-based assay to test PMLSC Chemistry Core synthesized analogs of confirmed hits from the Polo box domain (PBD) of Plk1 Primary HTS. PubChem Bioassay (2008)[AID] 
Target
Name:
Serine/threonine-protein kinase PLK1
Synonyms:
PLK PLK1 Polo-like kinase 1 (PlK1) STPK13 Serine/threonine-protein kinase 13 | polo-like kinase
Type:
Serine/threonine-protein kinase
Mol. Mass.:
68277.16
Organism:
Homo sapiens (Human)
Description:
P53350
Residue:
603
  
Inhibitor
Name:
BDBM46096
Synonyms:
2-[(6-hydroxy-2,4-diketo-1H-pyrimidine-5-carbonyl)amino]benzoic acid ethyl ester UPDDI-00294846 ethyl 2-[(6-hydroxy-2,4-dioxo-1H-pyrimidine-5-carbonyl)amino]benzoate | ethyl 2-[[6-oxidanyl-2,4-bis(oxidanylidene)-1H-pyrimidin-5-yl]carbonylamino]benzoate
Type:
Small organic molecule
Emp. Form.:
C14H13N3O6
Mol. Mass.:
319.2695
SMILES:
CCOC(=O)c1ccccc1NC(=O)c1c(O)[nH]c(=O)[nH]c1=O
: